{"text_format":"2","workbook":"xlsx","n_sheets":2,"sheets":["基本版 (2)","Basic Information"],"not_rendered":{"charts":0,"images":43,"macros":0,"external_links":1,"defined_names":4,"comments":0,"pivot_tables":0},"unopened":[],"bounds":{"document_bytes":16777216,"sheet_cells":100000,"run_cost":"one","rows_first":2000,"rows_last":500,"rows_between":2000,"halvings":0,"cell_chars":16384,"cell_head_chars":4096},"cells_cut":0,"cells_raw":0,"read":"whole","date_system":"1900"}

{"sheet":"基本版 (2)","index":0,"n_rows":481,"n_cols":8,"rows_kept":481,"cut":false,"hidden":true,"merged":[[0,2,0,3]]}
["序号","编码","中/英文品名及规格",null,"单位","数量","零售价  （不含税）"]
[1,null,null,null,"件"]
[2,"380700-T501-00000","转向阻尼器",null,"件",1,null,{"$f":"VLOOKUP(B3,[1]Sheet1!$B$2:$C$394,1,0)","v":"380700-T501-00000"}]
[3,"5021-06016-BS00","内六花六角法兰面螺栓M6x16(盘11)",null,"件",2,"方向阻力器支架与车架",{"$f":"VLOOKUP(B4,[1]Sheet1!$B$2:$C$394,1,0)","v":"5021-06016-BS00"}]
[4,"380800-T501-00000","转向阻尼器调节座",null,"件",1,null,{"$f":"VLOOKUP(B5,[1]Sheet1!$B$2:$C$394,1,0)","v":"380800-T501-00000"}]
[5,"360006-T501-00000","车架焊接总成",null,"件",1,null,{"$f":"VLOOKUP(B6,[1]Sheet1!$B$2:$C$394,1,0)","v":"360006-T501-00000"}]
[6,"900001-R100-000","车架铭牌85*25",null,"件",1,null,{"$f":"VLOOKUP(B7,[1]Sheet1!$B$2:$C$394,1,0)","v":"900001-R100-000"}]
[7,"5015-03010-SC00","铆钉3.2*10",null,"件",2,"铭牌与车架",{"$f":"VLOOKUP(B8,[1]Sheet1!$B$2:$C$394,1,0)","v":"5015-03010-SC00"}]
[8,"5008-08085-SC00","六角法兰面自锁螺母M8*1.25",null,"件",2,"发动机前悬挂与车架",{"$f":"VLOOKUP(B9,[1]Sheet1!$B$2:$C$394,1,0)","v":"5008-08085-SC00"}]
[9,"360077-T501-00000","喇叭支架",null,"件",1,null,{"$f":"VLOOKUP(B10,[1]Sheet1!$B$2:$C$394,1,0)","v":"360077-T501-00000"}]
[10,"360037-T501-00000","发动机前悬挂-左",null,"件",1,null,{"$f":"VLOOKUP(B11,[1]Sheet1!$B$2:$C$394,1,0)","v":"360037-T501-00000"}]
[11,"5021-08016-BS00","内六花六角法兰面螺栓M8x16(盘16)",null,"件",4,"发动机上悬挂板安装",{"$f":"VLOOKUP(B12,[1]Sheet1!$B$2:$C$394,1,0)","v":"5021-08016-BS00"}]
[12,"360039-T501-00000","发动机上悬挂-左",null,"件",1,null,{"$f":"VLOOKUP(B13,[1]Sheet1!$B$2:$C$394,1,0)","v":"360039-T501-00000"}]
[13,"910004-T501-00003","发动机下悬挂衬套-左∮10.5*∮24*5",null,"件",1,"系统",{"$f":"VLOOKUP(B14,[1]Sheet1!$B$2:$C$394,1,0)","v":{"$error":"#N/A"}}]
[14,"360040-T501-00000","发动机上悬挂-右",null,"件",1,null,{"$f":"VLOOKUP(B15,[1]Sheet1!$B$2:$C$394,1,0)","v":"360040-T501-00000"}]
[15,"360038-T501-00000","发动机前悬挂-右",null,"件",1,null,{"$f":"VLOOKUP(B16,[1]Sheet1!$B$2:$C$394,1,0)","v":"360038-T501-00000"}]
[16,"5021-08115-BS00","内六花六角法兰面螺栓M8x115(盘16)",null,"件",2,"发动机前悬挂",{"$f":"VLOOKUP(B17,[1]Sheet1!$B$2:$C$394,1,0)","v":"5021-08115-BS00"}]
[17,"910004-T501-00002","发动机下悬挂衬套-右∮10.5*∮20*26.5",null,"件",1,null,{"$f":"VLOOKUP(B18,[1]Sheet1!$B$2:$C$394,1,0)","v":"910004-T501-00002"}]
[18,"5008-10115-SC00","六角法兰面自锁螺母M10*1.25",null,"件",1,"侧支架与车架",{"$f":"VLOOKUP(B19,[1]Sheet1!$B$2:$C$394,1,0)","v":"5008-10115-SC00"}]
[19,"370013-T501-00000","侧支架",null,"件",1,null,{"$f":"VLOOKUP(B20,[1]Sheet1!$B$2:$C$394,1,0)","v":"370013-T501-00000"}]
[20,"5007-10042-BS00","侧支架专用螺栓M10×42.3 ",null,"件",1,"侧支架安装",{"$f":"VLOOKUP(B21,[1]Sheet1!$B$2:$C$394,1,0)","v":"5007-10042-BS00"}]
[21,"360057-T501-00000","侧支架安装挂板",null,"件",1,null,{"$f":"VLOOKUP(B22,[1]Sheet1!$B$2:$C$394,1,0)","v":"360057-T501-00000"}]
[22,"360020-T501-00001","侧支架簧∮9.5,线径1.6mm",null,"件",1,null,{"$f":"VLOOKUP(B23,[1]Sheet1!$B$2:$C$394,1,0)","v":"360020-T501-00001"}]
[23,"360020-T501-00000","侧支架簧∮15*110,线径2.5mm",null,"件",1,null,{"$f":"VLOOKUP(B24,[1]Sheet1!$B$2:$C$394,1,0)","v":"360020-T501-00000"}]
[1,"5001-14030-YH00","六角法兰面螺栓M14*1.5*30",null,"件",1,"上联接板与方向柱",{"$f":"VLOOKUP(B25,[1]Sheet1!$B$2:$C$394,1,0)","v":"5001-14030-YH00"}]
[2,"5018-15010-SC00","平垫∮15*∮33*1",null,"件",1,null,{"$f":"VLOOKUP(B26,[1]Sheet1!$B$2:$C$394,1,0)","v":"5018-15010-SC00"}]
[3,"5021-08035-BS00","内六花六角法兰面螺栓M8x35(盘13)",null,"件",4,"上联接板与减震",{"$f":"VLOOKUP(B27,[1]Sheet1!$B$2:$C$394,1,0)","v":"5021-08035-BS00"}]
[4,"370020-T501-00000","上连接板",null,"件",1,null,{"$f":"VLOOKUP(B28,[1]Sheet1!$B$2:$C$394,1,0)","v":"370020-T501-00000"}]
[5,"350025-T501-00000","油管卡子",null,"件",2,null,{"$f":"VLOOKUP(B29,[1]Sheet1!$B$2:$C$394,1,0)","v":"350025-T501-00000"}]
[6,"5021-08040-BS00","内六花六角法兰面螺栓M8x40(盘13)",null,"件",4,"下连接板与减震",{"$f":"VLOOKUP(B30,[1]Sheet1!$B$2:$C$394,1,0)","v":"5021-08040-BS00"}]
[7,"370102-T501-00000","下连接板",null,"件",1,null,{"$f":"VLOOKUP(B31,[1]Sheet1!$B$2:$C$394,1,0)","v":"370102-T501-00000"}]
[8,"370101-T501-00000","方向柱",null,"件",1,null,{"$f":"VLOOKUP(B32,[1]Sheet1!$B$2:$C$394,1,0)","v":"370101-T501-00000"}]
[9,"5010-25100-YH00","4槽调节螺母M25*1.0*10*44",null,"件",1,"方向柱锁紧",{"$f":"VLOOKUP(B33,[1]Sheet1!$B$2:$C$394,1,0)","v":"5010-25100-YH00"}]
[10,"371100-R100-00001","方向柱上防尘盖∮26mm*∮53mm,厚4.15",null,"件",1,null,{"$f":"VLOOKUP(B34,[1]Sheet1!$B$2:$C$394,1,0)","v":"371100-R100-00001"}]
[11,"370600-R100-000","方向上轴承32005",null,"件",1,null,{"$f":"VLOOKUP(B35,[1]Sheet1!$B$2:$C$394,1,0)","v":"370600-R100-000"}]
[12,"370700-R100-000","方向下轴承32006E",null,"件",1,null,{"$f":"VLOOKUP(B36,[1]Sheet1!$B$2:$C$394,1,0)","v":"370700-R100-000"}]
[13,"371200-R100-00001","方向柱下防尘盖∮30.2mm*∮61mm,厚5.06",null,"件",1,null,{"$f":"VLOOKUP(B37,[1]Sheet1!$B$2:$C$394,1,0)","v":"371200-R100-00001"}]
[14,"5021-06012-BS00","内六花六角法兰面螺栓M6x12(盘11)",null,"件",2,"李棋强，8.27日8：54新增1",{"$f":"VLOOKUP(B38,[1]Sheet1!$B$2:$C$394,1,0)","v":"5021-06012-BS00"}]
[1,"5010-16110-SC00","前轮轴螺母M16*1.5*11",null,"件",1,"前轮轴和平叉轴螺母",{"$f":"VLOOKUP(B39,[1]Sheet1!$B$2:$C$394,1,0)","v":"5010-16110-SC00"}]
[2,"5103-303704-000","油封∮30*∮37*4",null,"件",2,null,{"$f":"VLOOKUP(B40,[1]Sheet1!$B$2:$C$394,1,0)","v":"5103-303704-000"}]
[3,"910014-T501-00000","T型轴套∮17*∮22*40",null,"件",2,null,{"$f":"VLOOKUP(B41,[1]Sheet1!$B$2:$C$394,1,0)","v":"910014-T501-00000"}]
[4,"5106-223603-BS0","推力轴承∮22.2*∮36.5*3.6",null,"件",2,null,{"$f":"VLOOKUP(B42,[1]Sheet1!$B$2:$C$394,1,0)","v":"5106-223603-BS0"}]
[5,"5102-222930-BS0","滚针轴承∮22*∮29*30",null,"件",2,null,{"$f":"VLOOKUP(B43,[1]Sheet1!$B$2:$C$394,1,0)","v":"5102-222930-BS0"}]
[6,"5103-222904-000","油封∮22*∮29*4",null,"件",2,null,{"$f":"VLOOKUP(B44,[1]Sheet1!$B$2:$C$394,1,0)","v":"5103-222904-000"}]
[7,"420019-R201-000","平叉防尘盖",null,"件",4,null,{"$f":"VLOOKUP(B45,[1]Sheet1!$B$2:$C$394,1,0)","v":"420019-R201-000"}]
[8,"360300-T501-00000","平叉",null,"件",1,null,{"$f":"VLOOKUP(B46,[1]Sheet1!$B$2:$C$394,1,0)","v":"360300-T501-00000"}]
[9,"370011-T501-00000","链条调节器-左",null,"件",1,null,{"$f":"VLOOKUP(B47,[1]Sheet1!$B$2:$C$394,1,0)","v":"370011-T501-00000"}]
[10,"370012-T501-00000","链条调节器-右",null,"件",1,null,{"$f":"VLOOKUP(B48,[1]Sheet1!$B$2:$C$394,1,0)","v":"370012-T501-00000"}]
[11,"5008-08065-SC00","六角螺母M8",null,"件",2,"链条调节",{"$f":"VLOOKUP(B49,[1]Sheet1!$B$2:$C$394,1,0)","v":"5008-08065-SC00"}]
[12,"5002-08055-BS00","六角螺栓M8*55",null,"件",2,"链条调节",{"$f":"VLOOKUP(B50,[1]Sheet1!$B$2:$C$394,1,0)","v":"5002-08055-BS00"}]
[13,"360026-T501-00000","导链器",null,"件",1,null,{"$f":"VLOOKUP(B51,[1]Sheet1!$B$2:$C$394,1,0)","v":"360026-T501-00000"}]
[14,"420059-T501-00000","导链器橡胶块",null,"件",1,null,{"$f":"VLOOKUP(B52,[1]Sheet1!$B$2:$C$394,1,0)","v":"420059-T501-00000"}]
[15,"420059-T501-00001","导链器橡胶块",null,"件",1,null,{"$f":"VLOOKUP(B53,[1]Sheet1!$B$2:$C$394,1,0)","v":"420059-T501-00001"}]
[16,"5005-06012-BS01","十字盘头螺钉M6*12(盘头直径10.5)","BOM:5005-06012-BS02","件",3,"链条护卡",{"$f":"VLOOKUP(B54,[1]Sheet1!$B$2:$C$394,1,0)","v":{"$error":"#N/A"}}]
[17,"420018-R100-000","链条护卡压板",null,"件",3,null,{"$f":"VLOOKUP(B55,[1]Sheet1!$B$2:$C$394,1,0)","v":"420018-R100-000"}]
[18,"5021-06048-BS00","内六花六角法兰面螺栓M6x48(盘11)",null,"件",2,"导链器与平叉",{"$f":"VLOOKUP(B56,[1]Sheet1!$B$2:$C$394,1,0)","v":"5021-06048-BS00"}]
[19,"5008-06070-SC00","六角法兰面螺母M6",null,"件",2,"导链器与平叉",{"$f":"VLOOKUP(B57,[1]Sheet1!$B$2:$C$394,1,0)","v":"5008-06070-SC00"}]
[20,"5021-06012-BS00","内六花六角法兰面螺栓M6x12(盘11)",null,"件",1,"导链器与平叉",{"$f":"VLOOKUP(B58,[1]Sheet1!$B$2:$C$394,1,0)","v":"5021-06012-BS00"}]
[21,"370017-T501-00000","链条护卡",null,"件",1,null,{"$f":"VLOOKUP(B59,[1]Sheet1!$B$2:$C$394,1,0)","v":"370017-T501-00000"}]
[22,"410002-T501-00000","平叉轴",null,"件",1,null,{"$f":"VLOOKUP(B60,[1]Sheet1!$B$2:$C$394,1,0)","v":"410002-T501-00000"}]
[23,"5018-17025-BS00","平垫∮17*∮32*2.5",null,"件",1,"平叉轴锁紧",{"$f":"VLOOKUP(B61,[1]Sheet1!$B$2:$C$394,1,0)","v":"5018-17025-BS00"}]
[1,"5021-10052-BS00","内六花六角法兰面螺栓M10x52",null,"件",1,"后减震上方与车架",{"$f":"VLOOKUP(B62,[1]Sheet1!$B$2:$C$394,1,0)","v":"5021-10052-BS00"}]
[2.1,"371500-T501-00000","后减震器(KYB减震)",null,"件",1,null,{"$f":"VLOOKUP(B63,[1]Sheet1!$B$2:$C$394,1,0)","v":"371500-T501-00000"}]
[2.2,"371500-T501-00001","后减震器(渝安减震)",null,"件",1,null,{"$f":"VLOOKUP(B64,[1]Sheet1!$B$2:$C$394,1,0)","v":"371500-T501-00001"}]
[3,"5008-08085-SC00","六角法兰面自锁螺母M8*1.25",null,"件",1,"导链轮安装",{"$f":"VLOOKUP(B65,[1]Sheet1!$B$2:$C$394,1,0)","v":"5008-08085-SC00"}]
[4,"360800-T501-00000","导链轮总成",null,"件",1,null,{"$f":"VLOOKUP(B66,[1]Sheet1!$B$2:$C$394,1,0)","v":"360800-T501-00000"}]
[5,"5007-10061-BS00","导链轮螺栓M10*61",null,"件",1,"导链轮安装",{"$f":"VLOOKUP(B67,[1]Sheet1!$B$2:$C$394,1,0)","v":"5007-10061-BS00"}]
[6,"5103-222804-000","油封∮22*∮28*4",null,"件",2,null,{"$f":"VLOOKUP(B68,[1]Sheet1!$B$2:$C$394,1,0)","v":"5103-222804-000"}]
[7,"5013-10005-BS00","翻边衬套∮10.1*∮22*5",null,"件",2,"U形摇架与车架",{"$f":"VLOOKUP(B69,[1]Sheet1!$B$2:$C$394,1,0)","v":"5013-10005-BS00"}]
[8,"5018-18015-BS00","平垫∮18x∮27x1.5",null,"件",2,"U形摇架内部装",{"$f":"VLOOKUP(B70,[1]Sheet1!$B$2:$C$394,1,0)","v":"5018-18015-BS00"}]
[9,"5102-182420-BS0","滚针轴承∮18*∮24*20",null,"件",2,null,{"$f":"VLOOKUP(B71,[1]Sheet1!$B$2:$C$394,1,0)","v":{"$error":"#N/A"}}]
[10,"360008-T501-00001","U型摇架",null,"件",1,null,{"$f":"VLOOKUP(B72,[1]Sheet1!$B$2:$C$394,1,0)","v":"360008-T501-00001"}]
[11,"910016-T501-00000","U型摇架轴套∮10*∮18*87.5",null,"件",1,null,{"$f":"VLOOKUP(B73,[1]Sheet1!$B$2:$C$394,1,0)","v":{"$error":"#N/A"}}]
[12,"5001-10130-BS00","六角法兰面螺栓M10*1.25*130",null,"件",1,"U形摇架与车架",{"$f":"VLOOKUP(B74,[1]Sheet1!$B$2:$C$394,1,0)","v":"5001-10130-BS00"}]
[13,"5008-10115-SC00","六角法兰面自锁螺母M10*1.25",null,"件",1,"后减震与三角摇架",{"$f":"VLOOKUP(B75,[1]Sheet1!$B$2:$C$394,1,0)","v":"5008-10115-SC00"}]
[14,"5103-172603-000","油封∮17.5*∮26*3",null,"件",2,null,{"$f":"VLOOKUP(B76,[1]Sheet1!$B$2:$C$394,1,0)","v":"5103-172603-000"}]
[15,"360007-T501-00000","三角摇架",null,"件",1,null,{"$f":"VLOOKUP(B77,[1]Sheet1!$B$2:$C$394,1,0)","v":"360007-T501-00000"}]
[16,"910015-T501-00001","三角摇架轴套∮12*∮20*37",null,"件",1,null,{"$f":"VLOOKUP(B78,[1]Sheet1!$B$2:$C$394,1,0)","v":"910015-T501-00001"}]
[17,"910015-T501-00002","三角摇架轴套∮14*∮19*10.6",null,"件",1,null,{"$f":"VLOOKUP(B79,[1]Sheet1!$B$2:$C$394,1,0)","v":{"$error":"#N/A"}}]
[18,"910017-T501-00000","翻边轴承套∮10*∮14*7.2",null,"件",2,null,{"$f":"VLOOKUP(B80,[1]Sheet1!$B$2:$C$394,1,0)","v":{"$error":"#N/A"}}]
[19,"5102-192512-BS0","滚针轴承∮19.05*∮25.4*12.7",null,"件",1,null,{"$f":"VLOOKUP(B81,[1]Sheet1!$B$2:$C$394,1,0)","v":{"$error":"#N/A"}}]
[20,"5007-10045-BS00","扁头螺栓M10*45",null,"件",1,"三角摇架与后减",{"$f":"VLOOKUP(B82,[1]Sheet1!$B$2:$C$394,1,0)","v":"5007-10045-BS00"}]
[21,"5007-12085-BS00","扁头螺栓M12×85",null,"件",1,"三角摇架与平叉",{"$f":"VLOOKUP(B83,[1]Sheet1!$B$2:$C$394,1,0)","v":"5007-12085-BS00"}]
[22,"5008-12125-SC00","六角法兰面自锁螺母M12*1.25",null,"件",2,"U形摇架与三角摇架；三角摇架与平叉",{"$f":"VLOOKUP(B84,[1]Sheet1!$B$2:$C$394,1,0)","v":"5008-12125-SC00"}]
[23,"5103-253204-000","油封∮25*∮32*4",null,"件",4,null,{"$f":"VLOOKUP(B85,[1]Sheet1!$B$2:$C$394,1,0)","v":"5103-253204-000"}]
[24,"5013-12005-BS00","翻边衬套∮12.1*∮25*5",null,"件",4,"三角摇架",{"$f":"VLOOKUP(B86,[1]Sheet1!$B$2:$C$394,1,0)","v":"5013-12005-BS00"}]
[25,"5018-20115-BS00","平垫∮20.1*∮31*1.5",null,"件",4,"三角摇架平垫",{"$f":"VLOOKUP(B87,[1]Sheet1!$B$2:$C$394,1,0)","v":"5018-20115-BS00"}]
[26,"5102-202614-BS0","滚针轴承∮20*∮26*14",null,"件",4,null,{"$f":"VLOOKUP(B88,[1]Sheet1!$B$2:$C$394,1,0)","v":{"$error":"#N/A"}}]
[27,"910015-T501-00000","三角摇架轴套∮12*∮20*61.5",null,"件",1,null,{"$f":"VLOOKUP(B89,[1]Sheet1!$B$2:$C$394,1,0)","v":"910015-T501-00000"}]
[28,"5007-12105-BS00","扁头螺栓M12*105",null,"件",1,"三角摇架与U型摇架",{"$f":"VLOOKUP(B90,[1]Sheet1!$B$2:$C$394,1,0)","v":"5007-12105-BS00"}]
[1,"350027-T501-00000","前轮外胎",null,"件",1,null,{"$f":"VLOOKUP(B91,[1]Sheet1!$B$2:$C$394,1,0)","v":"350027-T501-00000"}]
[2,"350013-R100-000","气门嘴",null,"件",1,null,{"$f":"VLOOKUP(B92,[1]Sheet1!$B$2:$C$394,1,0)","v":"350013-R100-000"}]
[3,"350014-T501-00000","气门嘴盖",null,"件",1,"系统",{"$f":"VLOOKUP(B93,[1]Sheet1!$B$2:$C$394,1,0)","v":{"$error":"#N/A"}}]
[4,"352000-T501-00000","前网轮总成",null,"件",1,null,{"$f":"VLOOKUP(B94,[1]Sheet1!$B$2:$C$394,1,0)","v":"352000-T501-00000"}]
[5,"351700-T501-00000","前碟刹盘",null,"件",1,null,{"$f":"VLOOKUP(B95,[1]Sheet1!$B$2:$C$394,1,0)","v":"351700-T501-00000"}]
[6,"5021-06012-BS00","内六花六角法兰面螺栓M6x12(盘11)",null,"件",6,"前刹车盘安装",{"$f":"VLOOKUP(B96,[1]Sheet1!$B$2:$C$394,1,0)","v":"5021-06012-BS00"}]
[7.1,"410001-T501-00000","前轮轴(KYB减震器,长度238)",null,"件",1,null,{"$f":"VLOOKUP(B97,[1]Sheet1!$B$2:$C$394,1,0)","v":"410001-T501-00000"}]
[7.2,"410001-T501-00001","前轮轴(渝安减震器,长度229)",null,"件",1,null,{"$f":"VLOOKUP(B98,[1]Sheet1!$B$2:$C$394,1,0)","v":"410001-T501-00001"}]
[8,"5010-16110-SC00","前轮轴螺母M16*1.5*11",null,"件",1,null,{"$f":"VLOOKUP(B99,[1]Sheet1!$B$2:$C$394,1,0)","v":"5010-16110-SC00"}]
[9,"350041-T501-00000","前轮速传感器支架",null,"件",1,null,{"$f":"VLOOKUP(B100,[1]Sheet1!$B$2:$C$394,1,0)","v":"350041-T501-00000"}]
[10,"5004-05008-BS00","内六角盘头螺钉M5*8",null,"件",1,null,{"$f":"VLOOKUP(B101,[1]Sheet1!$B$2:$C$394,1,0)","v":{"$error":"#N/A"}}]
[11,"350041-T501-00001","前轮速传感器支架",null,"件",1,null,{"$f":"VLOOKUP(B102,[1]Sheet1!$B$2:$C$394,1,0)","v":"350041-T501-00001"}]
[12,"5103-273707-000","油封∮27*∮37*7",null,"件",2,null,{"$f":"VLOOKUP(B103,[1]Sheet1!$B$2:$C$394,1,0)","v":"5103-273707-000"}]
[13,"910012-T501-00002","前轮衬套-右∮20*∮27*13.5",null,"件",1,null,{"$f":"VLOOKUP(B104,[1]Sheet1!$B$2:$C$394,1,0)","v":"910012-T501-00002"}]
[14,"5101-203709-BS0","轴承20*37*9",null,"件",2,"系统",{"$f":"VLOOKUP(B105,[1]Sheet1!$B$2:$C$394,1,0)","v":{"$error":"#N/A"}}]
[15,"910004-R201-000","衬套∮5.3*∮7.3*5",null,"件",1,null,{"$f":"VLOOKUP(B106,[1]Sheet1!$B$2:$C$394,1,0)","v":"910004-R201-000"}]
[16,"910001-T500-00000","前轮衬套-左",null,"件",1,null,{"$f":"VLOOKUP(B107,[1]Sheet1!$B$2:$C$394,1,0)","v":"910001-T500-00000"}]
[1,"350030-T501-00000","后轮外胎",null,"件",1,null,{"$f":"VLOOKUP(B108,[1]Sheet1!$B$2:$C$394,1,0)","v":"350030-T501-00000"}]
[2,"350013-R100-000","气门嘴",null,"件",1,null,{"$f":"VLOOKUP(B109,[1]Sheet1!$B$2:$C$394,1,0)","v":"350013-R100-000"}]
[3,"350014-T501-00000","气门嘴盖",null,"件",1,"系统",{"$f":"VLOOKUP(B110,[1]Sheet1!$B$2:$C$394,1,0)","v":{"$error":"#N/A"}}]
[4,"352100-T501-00000","后网轮总成",null,"件",1,null,{"$f":"VLOOKUP(B111,[1]Sheet1!$B$2:$C$394,1,0)","v":"352100-T501-00000"}]
[5,"351800-T501-00000","后碟刹盘",null,"件",1,null,{"$f":"VLOOKUP(B112,[1]Sheet1!$B$2:$C$394,1,0)","v":"351800-T501-00000"}]
[6,"5021-06016-BS00","内六花六角法兰面螺栓M6x16(盘11)",null,"件",4,"后碟刹盘与后轮",{"$f":"VLOOKUP(B113,[1]Sheet1!$B$2:$C$394,1,0)","v":"5021-06016-BS00"}]
[7,"410003-T501-00000","后轮轴",null,"件",1,null,{"$f":"VLOOKUP(B114,[1]Sheet1!$B$2:$C$394,1,0)","v":"410003-T501-00000"}]
[8,"910002-T500-00000","后轮衬套-左",null,"件",1,null,{"$f":"VLOOKUP(B115,[1]Sheet1!$B$2:$C$394,1,0)","v":"910002-T500-00000"}]
[9,"910003-T500-00000","后轮衬套-右",null,"件",1,null,{"$f":"VLOOKUP(B116,[1]Sheet1!$B$2:$C$394,1,0)","v":"910003-T500-00000"}]
[10,"5018-22520-BS00","平垫∮22.5*∮35*2",null,"件",1,null,{"$f":"VLOOKUP(B117,[1]Sheet1!$B$2:$C$394,1,0)","v":"5018-22520-BS00"}]
[11,"5010-22125-SC00","后轮轴螺母M22*1.5",null,"件",1,"后轮轴螺母",{"$f":"VLOOKUP(B118,[1]Sheet1!$B$2:$C$394,1,0)","v":"5010-22125-SC00"}]
[12,"5101-255215-BS0","轴承25*52*15",null,"件",2,"系统",{"$f":"VLOOKUP(B119,[1]Sheet1!$B$2:$C$394,1,0)","v":{"$error":"#N/A"}}]
[13,"910004-R201-000","衬套∮5.3*∮7.3*5",null,"件",1,null,{"$f":"VLOOKUP(B120,[1]Sheet1!$B$2:$C$394,1,0)","v":"910004-R201-000"}]
{"$rows_left_out":362}
{"sheet":"Basic Information","index":1,"n_rows":946,"n_cols":8,"rows_kept":946,"cut":false,"hidden":false,"merged":[[0,0,0,7],[1,3,1,4],[22,0,22,7],[23,3,23,4],[44,0,44,7],[45,3,45,4],[66,0,66,7],[67,3,67,4],[88,0,88,7],[89,3,89,4],[110,0,110,7],[111,3,111,4],[132,0,132,7],[133,3,133,4],[154,0,154,7],[155,3,155,4],[176,0,176,7],[177,3,177,4],[198,0,198,7],[199,3,199,4],[220,0,220,7],[221,3,221,4],[242,0,242,7],[243,3,243,4],[264,0,264,7],[265,3,265,4],[286,0,286,7],[287,3,287,4],[308,0,308,7],[309,3,309,4],[330,0,330,7],[331,3,331,4],[352,0,352,7],[353,3,353,4],[374,0,374,7],[375,3,375,4],[396,0,396,7],[397,3,397,4],[418,0,418,7],[419,3,419,4],[440,0,440,7],[462,0,462,7],[463,3,463,4],[484,0,484,7],[485,3,485,4],[506,0,506,7],[507,3,507,4],[528,0,528,7],[529,3,529,4],[550,0,550,7],[551,3,551,4],[572,0,572,7],[573,3,573,4],[594,0,594,7],[595,3,595,4],[616,0,616,7],[617,3,617,4],[638,0,638,7],[639,3,639,4],[660,0,660,7],[661,3,661,4],[682,0,682,7],[683,3,683,4],[704,0,704,7],[705,3,705,4],[726,0,726,7],[727,3,727,4],[748,0,748,7],[749,3,749,4],[770,0,770,7],[771,3,771,4],[792,0,792,7],[793,3,793,4],[814,0,814,7],[815,3,815,4],[836,0,836,7],[837,3,837,4],[858,0,858,7],[859,3,859,4],[880,0,880,7],[881,3,881,4],[902,0,902,7],[903,3,903,4],[924,0,924,7],[925,3,925,4],[2,0,21,0],[24,0,43,0],[46,0,65,0],[68,0,87,0],[90,0,109,0],[112,0,131,0],[134,0,153,0],[156,0,175,0],[178,0,197,0],[200,0,219,0],[222,0,241,0],[244,0,263,0],[266,0,285,0],[288,0,307,0],[310,0,329,0],[332,0,351,0],[354,0,373,0],[376,0,395,0],[398,0,417,0],[420,0,439,0],[442,0,461,0],[464,0,483,0],[486,0,505,0],[508,0,527,0],[530,0,549,0],[552,0,571,0],[574,0,593,0],[596,0,615,0],[618,0,637,0],[640,0,659,0],[662,0,681,0],[684,0,703,0],[706,0,725,0],[728,0,747,0],[750,0,769,0],[772,0,791,0],[794,0,813,0],[816,0,835,0],[838,0,857,0],[860,0,879,0],[882,0,901,0],[904,0,923,0],[926,0,945,0]]}
["F-1 Frame Assy"]
["PHOTO","NO.","Part CODE","Chinese/Chinese/English name and specification",null,"UNIT","QTY","PRICE  (excluding tax)"]
[null,1,"380700-T501-00000","转向阻尼器","Steering dampers","PIECE",4]
[null,2,"5021-06016-BS00","内六花六角法兰面螺栓M6*16(盘11)","Bolt,Hex.Flange M6x16 (Panhead 11)","PIECE",8]
[null,3,"380800-T501-00000","转向阻尼器调节座","Adjusting Block, Steering Damper ","PIECE",4]
[null,4,"360006-T501-00000","车架焊接总成","Frame Assy","PIECE"]
[null,5,"900001-R100-000","车架铭牌85*25","Frame nameplate 85*25","PIECE"]
[null,6,"5015-03010-SC00","铆钉3.2*10"," Rivet .2*10","PIECE"]
[null,7,"5008-08085-SC00","六角法兰面自锁螺母M8*1.25","Tapping Nut,Hex.Flange M8*1.25","PIECE"]
[null,8,"360077-T501-00000","喇叭支架"," Horn Bracket","PIECE"]
[null,9,"360037-T501-00000","发动机前悬挂-左","EngineFront Suspension - left","PIECE"]
[null,10,"5021-08016-BS00","内六花六角法兰面螺栓M8*16(盘16)","Bolt,Hex.Flange M8x16(Panhead 16)","PIECE"]
[null,11,"360039-T501-00000","发动机上悬挂-左","Engine upper suspension - left","PIECE"]
[null,12,"910004-T501-00003","发动机下悬挂衬套-左∮10.5*∮24*5","Lower Engine Suspension Bushing-Left ∮10.5*∮24*5","PIECE"]
[null,13,"360040-T501-00000","发动机上悬挂-右","Engine upper suspension - right","PIECE"]
[null,14,"360038-T501-00000","发动机前悬挂-右","Engine front suspension-right","PIECE"]
[null,15,"5021-08115-BS00","内六花六角法兰面螺栓M8*115(盘16)","Bolt,Hex.Flange M8x115(Panhead 16)","PIECE"]
[null,16,"910004-T501-00002","发动机下悬挂衬套-右∮10.5*∮20*26.5","Lower Engine Suspension Bushing-Right∮10.5*∮20*26.5","PIECE"]
[null,17,"5008-10115-SC00","六角法兰面自锁螺母M10*1.25","Tapping Nut,Hex.Flange M10*1.25","PIECE"]
[null,18,"370013-T501-00001","侧支架","Side Stand","PIECE"]
[null,19,"5007-10042-BS00","侧支架专用螺栓M10*42.3 ","Bolt,Side Stand M10×42.3 ","PIECE"]
[null,20,"360057-T501-00000","侧支架安装挂板","Side Stand mounting pendant plate","PIECE"]
["F-1 Frame Assy-1"]
["PHOTO","NO.","Part CODE","Chinese/Chinese/English name and specification",null,"UNIT","QTY","PRICE  (excluding tax)"]
[null,21,"360020-T501-00001","侧支架簧∮9.5,线径1.6mm","Spring, Side Stand∮9.5,  Line Diameter 1.6mm","PIECE"]
[null,22,"360020-T501-00000","侧支架簧∮15*110,线径2.5mm","Spring, Side Stand∮9.5,  Line Diameter 1.6mm","PIECE"]
[null,23]
[null,24]
[null,25]
[null,26]
[null,27]
[null,28]
[null,29]
[null,30]
[null,31]
[null,32]
[null,33]
[null,34]
[null,35]
[null,36]
[null,37]
[null,38]
[null,39]
[null,40]
["F-2 Steering column"]
["PHOTO","NO.","Part CODE","Chinese/Chinese/English name and specification",null,"UNIT","QTY","PRICE  (excluding tax)"]
[null,1,"5001-14030-YH00","六角法兰面螺栓M14*1.5*30","Bolt,Hex.Flange M14*1.5*30","PIECE",null,"Upper Connecting Plate and steering column"]
[null,2,"5018-15010-SC00","平垫∮15*∮33*1","Washer,Flat∮15*∮33*1","PIECE"]
[null,3,"5021-08035-BS00","内六花六角法兰面螺栓M8*35(盘13)","Bolt,Hex.Flange M8x35(Panhead 13)","PIECE",null,"Upper Connecting Plate and shock absorption"]
[null,4,"370020-T501-00000","上连接板","Connecting Plate, Upper","PIECE"]
[null,5,"350025-T501-00000","油管卡子","Oil pipe clip","PIECE"]
[null,6,"5021-08040-BS00","内六花六角法兰面螺栓M8*40(盘13)","Bolt,Hex.Flange M8x40 (Panhead 13)","PIECE",null,"Upper Connecting Plate and shock absorption"]
[null,7,"370102-T501-00000","下连接板","Connecting Plate, Lower","PIECE"]
[null,8,"370101-T501-00000","方向柱","Steering Column","PIECE"]
[null,9,"5010-25100-YH00","4槽调节螺母M25*1.0*10*44","Nut, Adjustable 4 Groove M25*1.0*10*44","PIECE",null,"Steering column locking"]
[null,10,"371100-R100-00001","方向柱上防尘盖∮26mm*∮53mm,厚4.15","Upper Cap,Steering Column Anti-Dust ∮26mm*∮53mm, THK：4.15","PIECE"]
[null,11,"370600-R100-000","方向上轴承32005","Bearing, Steering Column Upper 32005","PIECE"]
[null,12,"370700-R100-000","方向下轴承32006E","Bearing, Steering Column Lower 32006E","PIECE"]
[null,13,"371200-R100-00001","方向柱下防尘盖∮30.2mm*∮61mm,厚5.06","Lower Cap,Steering Column Anti-Dust∮30.2mm*∮61mm, THK: 5.06","PIECE"]
[null,14,"5021-06012-BS00","内六花六角法兰面螺栓M6x12(盘11)","Bolt,Hex.Flange M6x12(Panhead 11)","PIECE"]
[null,15]
[null,16]
[null,17]
[null,18]
[null,19]
[null,20]
["F-3  Flat fork"]
["PHOTO","NO.","Part CODE","Chinese/Chinese/English name and specification",null,"UNIT","QTY","PRICE  (excluding tax)"]
[null,1,"5010-16110-BS00","前轮轴螺母M16*1.5"," Nut, Front wheel axle M16*1.5","PIECE",null,"前轮轴和平叉轴螺母"]
[null,2,"5103-303704-000","油封∮30*∮37*4","Oil Seal∮30*∮37*4","PIECE"]
[null,3,"910014-T501-00000","T型轴套∮17*∮22*40","T-bush ∮17*∮22*40","PIECE"]
[null,4,"5106-223603-BS0","推力轴承∮22.2*∮36.5*3.6","Thrust Bearing∮22.2*∮36.5*3.6","PIECE"]
[null,5,"5102-222930-BS0","滚针轴承∮22*∮29*30","Needle Bearing ∮22*∮29*30","PIECE"]
[null,6,"5103-222904-000","油封∮22*∮29*4","Oil Seal∮22*∮29*4","PIECE"]
[null,7,"420019-R201-000","平叉防尘盖","Rear Arm,Anti-dust","PIECE"]
[null,8,"360300-T501-00000","平叉","Rear Arm","PIECE"]
[null,9,"370011-T501-00000","链条调节器-左","Chain Adjuster(Left)","PIECE"]
[null,10,"370012-T501-00000","链条调节器-右","Chain Adjuster(Right)","PIECE"]
[null,11,"5008-08065-SC00","六角螺母M8","Bolt,Hex M8","PIECE",null,"链条调节"]
[null,12,"5002-08055-BS00","六角螺栓M8*55","Hex Bolt M8*55","PIECE",null,"链条调节"]
[null,13,"360026-T501-00000","导链器","Chain Guide","PIECE"]
[null,14,"420059-T501-00000","导链器橡胶块","Rubber Blocks, Chain guide ","PIECE"]
[null,15,"420059-T501-00001","导链器橡胶块","Rubber Block, Chain guide ","PIECE"]
[null,16,"5005-06012-BS02","十字盘头螺钉M6*12(盘头直径10.5)","Screw, Cross-Shaped,Cup Head M6*12(Head diameter10.5)","PIECE",null,"链条护卡"]
[null,17,"420018-R100-000","链条护卡压板"," Protecting Plate Press Plate, Chain","PIECE"]
[null,18,"5021-06048-BS00","内六花六角法兰面螺栓M6*48(盘11)","Bolt,Hex.Flange M6x48(Panhead 11)","PIECE",null,"导链器与平叉"]
[null,19,"5008-06070-SC00","六角法兰面螺母M6","Nut,Hex.Flange M6","PIECE",null,"导链器与平叉"]
[null,20,"5021-06012-BS00","内六花六角法兰面螺栓M6*12(盘11)","Bolt,Hex.Flange M6x12(Panhead 11)","PIECE",null,"导链器与平叉"]
["F-3  Flat fork-1"]
["PHOTO","NO.","Part CODE","Chinese/Chinese/English name and specification",null,"UNIT","QTY","PRICE  (excluding tax)"]
[null,21,"370017-T501-00000","链条护卡","Bolt,Hex.Flange","PIECE"]
[null,22,"410002-T501-00000","平叉轴","Axle,Rear Arm","PIECE"]
[null,23,"5018-17025-BS00","平垫∮17*∮32*2.5","Washer,Flat ∮17*∮32*2.5","PIECE",null,"平叉轴锁紧"]
[null,24]
[null,25]
[null,26]
[null,27]
[null,28]
[null,29]
[null,30]
[null,31]
[null,32]
[null,33]
[null,34]
[null,35]
[null,36]
[null,37]
[null,38]
[null,39]
[null,40]
["F-4 Rear shock absorber & Cradle"]
["PHOTO","NO.","Part CODE","Chinese/Chinese/English name and specification",null,"UNIT","QTY","PRICE  (excluding tax)"]
[null,1,"5021-10052-BS00","内六花六角法兰面螺栓M10*52","Bolt,Hex.Flange M10x52","PIECE"]
[null,2.1,"371500-T501-00000","后减震器(KYB减震)","Rear Shock Absorber (KYB Absorber)","PIECE"]
[null,2.2,"371500-T501-00001","后减震器(渝安减震)","Rear Shock Absorber(YU'AN Absorber)","PIECE"]
[null,3,"5008-08085-SC00","六角法兰面自锁螺母M8*1.25","Tapping Nut,Hex.Flange M8*1.25","PIECE"]
[null,4,"360800-T501-00000","导链轮总成","Guide Sprocket Assembly","PIECE"]
[null,5,"5007-10061-BS00","导链轮螺栓M10*61","Guide Sprocket Bolt M10*61","PIECE"]
[null,6,"5103-222804-000","油封∮22*∮28*4","Oil Seal∮22*∮28*4","PIECE"]
[null,7,"5013-10005-SC01","翻边衬套∮10.1*∮22*5","Bushing,Flange∮10.1*∮22*5","PIECE"]
{"$rows_left_out":826}